[buildgear-devel] compiling error when building libcap-2.22 for raspberrypi mini-distribution

Elis POPESCU elisescu at yahoo.com
Fri Apr 5 12:10:19 MDT 2013


Hi,

Apparently I'm having some problems when compiling the raspberrypi mini-distribution for fs. I get an error when libcap-2.22 is compiled, as you can see here:

make[1]: Leaving directory `/home/elisescu/workspace/raspberrypi/raspberrypi/build/work/cross/libcap/src/libcap-2.22/libcap'                                            [26/252]
make -C pam_cap all
make[1]: Entering directory `/home/elisescu/workspace/raspberrypi/raspberrypi/build/work/cross/libcap/src/libcap-2.22/pam_cap'
arm-bcm2835-linux-gnueabi-gcc -O2 -D_LARGEFILE64_SOURCE -D_FILE_OFFSET_BITS=64 -Dlinux -Wall -Wwrite-strings -Wpointer-arith -Wcast-qual -Wcast-align -Wstrict-prototypes -Wmiss
ing-prototypes -Wnested-externs -Winline -Wshadow -g  -fPIC -I/home/elisescu/workspace/raspberrypi/raspberrypi/build/work/cross/libcap/src/libcap-2.22/pam_cap/../libcap/include
 -I/home/elisescu/workspace/raspberrypi/raspberrypi/build/work/cross/libcap/src/libcap-2.22/pam_cap/../libcap/include -c pam_cap.c -o pam_cap.o
pam_cap.c:19:34: fatal error: security/pam_modules.h: No such file or directory
compilation terminated.
make[1]: *** [pam_cap.o] Error 1
make[1]: Leaving directory `/home/elisescu/workspace/raspberrypi/raspberrypi/build/work/cross/libcap/src/libcap-2.22/pam_cap'
make: *** [all] Error 2
ERROR: build() failed.

I'm using Ubuntu 12.10 and buildgear 0.9.15beta. The command used to build was: buildgear build fs.

Vasile.
-------------- next part --------------
An HTML attachment was scrubbed...
URL: <http://buildgear.org/pipermail/buildgear-devel_buildgear.io/attachments/20130405/4da2850d/attachment.html>


More information about the buildgear-devel mailing list