[buildgear-devel] Buildgear: build failure for u-boot

Martin Lund martin.lund at keep-it-simple.com
Mon Jun 9 16:12:42 MDT 2014


Hi Lad,

It's failing to build the cross toolchain - I've seen this issue with 
crosstool-ng 1.18 and recent ubuntu distributions.

The solution is to upgrade to crosstool-ng 1.19.

Actually, I was about to update our beaglebone distribution but since 
you have this issue I will update the pandaboard distribution asap - 
that should fix your issue.

/Martin

On 2014-06-09 12:53, Prabhakar Lad wrote:
> Hi Folks,
>
> I was trying to build u-boot from the mini-distribution example of pandaboard,
> but I see following error when I try and build u-boot,
>
> ...
> [INFO ]  Installing kernel headers: done in 9.88s (at 19:13)
> [INFO ]  =================================================================
> [INFO ]  Installing C library headers & start files
> [EXTRA]    Configuring C library
> [EXTRA]    Installing C library headers
> [EXTRA]    Installing C library start files
> [ERROR]    check_fds.c:84:1: internal compiler error: Segmentation fault
> [ERROR]    make[3]: ***
> [/home/prabhakar/work/buildgear/pandaboard/build/work/native/crosstool-ng/src/crosstool-ng-1.18.0/.build/arm-cortex_a9-linux-gnueabi/build/build-libc-startfiles/csu/check_fds.o]
> Error 1
> [ERROR]    make[2]: *** [csu/subdir_lib] Error 2
> [ERROR]    make[1]: *** [csu/subdir_lib] Error 2
> [ERROR]
> [ERROR]  >>
> [ERROR]  >>  Build failed in step 'Installing C library headers & start files'
> [ERROR]  >>        called in step '(top-level)'
> [ERROR]  >>
> [ERROR]  >>  Error happened in: CT_DoExecLog[scripts/functions at 257]
> [ERROR]  >>        called from:
> do_libc_backend_once[scripts/build/libc/glibc-eglibc.sh-common at 421]
> [ERROR]  >>        called from:
> do_libc_backend[scripts/build/libc/glibc-eglibc.sh-common at 143]
> [ERROR]  >>        called from:
> do_libc_start_files[scripts/build/libc/glibc-eglibc.sh-common at 60]
> [ERROR]  >>        called from: main[scripts/crosstool-NG.sh at 632]
> [ERROR]  >>
> [ERROR]  >>  There is a list of known issues, some with workarounds, in:
> [ERROR]  >>      'docs/B - Known issues.txt'
> [ERROR]
> [ERROR]  (elapsed: 19:39.31)
> make: *** [build] Error 2
> ERROR: build() failed
>
> Is it a known issue and can be fixed ? Any pointer on this would be helpful.
>
> Regards,
> --Prabhakar Lad
>
> _______________________________________________
> buildgear-devel mailing list
> buildgear-devel at buildgear.org
> http://buildgear.org/mailman/listinfo/buildgear-devel_buildgear.org





More information about the buildgear-devel mailing list