[buildgear-devel] Buildgear: build failure for u-boot

Prabhakar Lad prabhakar.csengg at gmail.com
Mon Jun 9 04:53:55 MDT 2014

Hi Folks,

I was trying to build u-boot from the mini-distribution example of pandaboard,
but I see following error when I try and build u-boot,

[INFO ]  Installing kernel headers: done in 9.88s (at 19:13)
[INFO ]  =================================================================
[INFO ]  Installing C library headers & start files
[EXTRA]    Configuring C library
[EXTRA]    Installing C library headers
[EXTRA]    Installing C library start files
[ERROR]    check_fds.c:84:1: internal compiler error: Segmentation fault
[ERROR]    make[3]: ***
Error 1
[ERROR]    make[2]: *** [csu/subdir_lib] Error 2
[ERROR]    make[1]: *** [csu/subdir_lib] Error 2
[ERROR]  >>
[ERROR]  >>  Build failed in step 'Installing C library headers & start files'
[ERROR]  >>        called in step '(top-level)'
[ERROR]  >>
[ERROR]  >>  Error happened in: CT_DoExecLog[scripts/functions at 257]
[ERROR]  >>        called from:
do_libc_backend_once[scripts/build/libc/glibc-eglibc.sh-common at 421]
[ERROR]  >>        called from:
do_libc_backend[scripts/build/libc/glibc-eglibc.sh-common at 143]
[ERROR]  >>        called from:
do_libc_start_files[scripts/build/libc/glibc-eglibc.sh-common at 60]
[ERROR]  >>        called from: main[scripts/crosstool-NG.sh at 632]
[ERROR]  >>
[ERROR]  >>  There is a list of known issues, some with workarounds, in:
[ERROR]  >>      'docs/B - Known issues.txt'
[ERROR]  (elapsed: 19:39.31)
make: *** [build] Error 2
ERROR: build() failed

Is it a known issue and can be fixed ? Any pointer on this would be helpful.

--Prabhakar Lad

More information about the buildgear-devel mailing list